RDF description of 受取手形の資産額
primary topic: 受取手形の資産額

受取手形の資産額
type: TerminologyConcept
in scheme: TerminologyConceptScheme
top concept of: TerminologyConceptScheme
broader: Ta00031
created: 2017-12-01
description: 商品、原材料などを売り渡した場合、取引先から受け取る約束手形、為替手形などの手形債権の額。割引に付した手形、不渡手形や融通手形、貸倒引当金などは含まない。破産債権、再生債権、更生債権その他これらに準ずる債権で１年以内に回収されないことが明らかなものを除く。