種苗・苗木の金額
type: TerminologyConcept
description: 種苗・苗木の生産原価。生産原価とは、売り上げた生産物の生産に直接的に要した費用（＝売上原価）をいう。
created: 2017-12-01
broader: Ta00100
top concept of: TerminologyConceptScheme
in scheme: TerminologyConceptScheme

RDF description of 種苗・苗木の金額
primary topic: 種苗・苗木の金額