手術名Ａ
type: TerminologyConcept
description: 退院患者が当該医療施設に入院して退院するまでの間に当該傷病に関して行われた手術名。手術の種類は、「開頭手術」、「開胸手術」、「開腹手術」、「筋骨格系手術（四肢体幹）」、「腹腔鏡下手術」、「内視鏡下手術」、「シャント設置術（人口透析を目的としたもの）」、「眼内レンズ挿入術」、「体外衝撃波結石破砕術」、「その他の手術」とする。ただし、分娩時の会陰部切開は含まない。【平成20年10月 手術の種類の一部に変更があり「手術名A」として設定。】
created: 2017-12-01
broader: Ta00634
in scheme: TerminologyConceptScheme
top concept of: TerminologyConceptScheme

RDF description of 手術名Ａ
primary topic: 手術名Ａ