手術時期_2A
type: TerminologyConcept
description: 手術を行った時期。手術が二日以上に続けて行われた場合、初日を手術の時期とする。１次手術、２次手術というように何回かに手術が分かれ、その日時が異なる場合は、その全ての時期とする。手術を行った部位及び主要所見とする。【平成20年10月 「手術時期_1」の定義に変更があり「手術時期_1A」と設定したため、「手術時期_2」の内容に変更はありませんが、「手術時期_2A」と設定。】
created: 2017-12-01
broader: Ta00339
top concept of: TerminologyConceptScheme
in scheme: TerminologyConceptScheme

RDF description of 手術時期_2A
primary topic: 手術時期_2A