RDF description of 手間替え・ゆい・手伝い数
primary topic: 手間替え・ゆい・手伝い数

手間替え・ゆい・手伝い数
type: TerminologyConcept
description: 農家相互間で等価交換を原則としているすべての労力交換及び金品の授受を伴わない無償の受入れ労働の人数。当該農業経営の構成員（農家の世帯員等）は除き、離れて住んでいる子供等の手伝いを含む。また、農業研修生を受け入れ、農作業に従事してもらっている場合、無償であれば含み、賃金相当額の金銭・物品等の支払があれば除く。【平成22年２月 定義内容に変更があり、手間替え・ゆい・手伝い数は、臨時雇数に含まれる。】
created: 2017-12-01
broader: Ta00116
in scheme: TerminologyConceptScheme
top concept of: TerminologyConceptScheme