借入金の種類
type: TerminologyConcept
description: 借入金の種類。財投・財政資金、農協系投資金、農業近代化資金、その他市中銀行等からの借入などがある。
created: 2017-12-01
broader: Ta00560
in scheme: TerminologyConceptScheme
top concept of: TerminologyConceptScheme

RDF description of 借入金の種類
primary topic: 借入金の種類