RDF description of 社内預金その他の預貯金の有無_2
primary topic: 社内預金その他の預貯金の有無_2

社内預金その他の預貯金の有無_2
type: TerminologyConcept
in scheme: TerminologyConceptScheme
top concept of: TerminologyConceptScheme
broader: Ta00557
created: 2017-12-01
description: 社内預金（労働基準法に基づき、会社と社員の協定により、会社自らが社員の預金を受け入れて管理をするものをいう。）、勤め先の互助会、共済組合などへの預貯金、勤労者財産形成貯蓄などの有無。