RDF description of 車両・運搬具・機械・装置・建物・構築物の減価償却費
primary topic: 車両・運搬具・機械・装置・建物・構築物の減価償却費

車両・運搬具・機械・装置・建物・構築物の減価償却費
type: TerminologyConcept
description: 車両・運搬具・機械・装置・建物・構築物の減価償却費。減価償却費とは、固定資産のうち償却資産について消耗、摩損、老朽、権利の消失などによって、その効益を漸次消失することにより発生する価値の減耗部分をいう。
created: 2017-12-01
broader: Ta00032
in scheme: TerminologyConceptScheme
top concept of: TerminologyConceptScheme