RDF description of 社会福祉士の常勤換算数
primary topic: 社会福祉士の常勤換算数

社会福祉士の常勤換算数
type: TerminologyConcept
in scheme: TerminologyConceptScheme
top concept of: TerminologyConceptScheme
broader: Ta00119
created: 2017-12-01
description: 施設が直接雇い入れた者、派遣労働者、出向者、一般の従事者と同様の勤務状況にある家族従事者のうち、その施設で定めた１週間の勤務時間により常勤に換算した社会福祉士の数。社会福祉士とは、社会福祉士の資格を有し、登録を受けている者をいう。