RDF description of 社会教育主事数A
primary topic: 社会教育主事数A

社会教育主事数A
type: TerminologyConcept
in scheme: TerminologyConceptScheme
top concept of: TerminologyConceptScheme
broader: Ta00118
created: 2017-12-01
description: 教育委員会事務局の職員として発令されている者のうち、文部科学省生涯学習政策局及びスポーツ・青少年局青少年課の掌握事務に直結した諸事務を主として行っている社会教育関係課の職員のうち社会教育法第９条の２の規定に基づいて置かれた社会教育主事の人数。【平成28年8月 文部科学省に組織改編があったため、「社会教育主事数」に定義内容を変更】