RDF description of 実用新案権数
primary topic: 実用新案権数

実用新案権数
type: TerminologyConcept
in scheme: TerminologyConceptScheme
top concept of: TerminologyConceptScheme
broader: Ta00457
created: 2017-12-01
description: 開発如何に関わらず、登録料を継続的に支払っている実用新案権（物品の形状、構造、組合せの考案であって、実用新案法に従って登録したもの）の件数。