RDF description of 実作業面積
primary topic: 実作業面積

実作業面積
type: TerminologyConcept
in scheme: TerminologyConceptScheme
top concept of: TerminologyConceptScheme
broader: Ta00198
created: 2017-12-01
description: 林業作業を行った区画単位の面積。１つの区画において同一作業を２回以上行った場合は、作業面積として積み上げるのではなく、その区画面積とする。