RDF description of 自立活動担当教員数
primary topic: 自立活動担当教員数

自立活動担当教員数
type: TerminologyConcept
description: 教育職員免許法施行規則により特別支援学校の自立活動の教諭の一種免許状を授与されて特別支援学校において自立活動を担任している教員及び前記の免許状は有していないが、特別支援学校において専ら自立活動を担任している教員の数。自立活動とは、学習上又は生活上の困難を克服し自立を図るために必要な知識技能の習得を目的とする教育に係る活動をいう。
created: 2017-12-01
broader: Ta00122
in scheme: TerminologyConceptScheme
top concept of: TerminologyConceptScheme