自動炊飯器所有数
type: TerminologyConcept
created: 2017-12-01
narrower: si327010097
top concept of: TerminologyConceptScheme
broader: Ta00430
in scheme: TerminologyConceptScheme
description: 自動炊飯器の所有総数。遠赤釜とは遠赤外線により飯を炊き上げる炊飯器をいい、ＩＨ型とは磁力線によって内釜そのものが発熱する炊飯器をいう。
narrower: si327020094

RDF description of 自動炊飯器所有数
primary topic: 自動炊飯器所有数