自動車の国産・輸入の別
type: TerminologyConcept
description: 日本国内で作られているものと外国で作られているものとの別。外国で作られた日本メーカーの車（逆輸入車）は国産車とする。
created: 2017-12-01
narrower: si327010108
in scheme: TerminologyConceptScheme
broader: Ta00653
top concept of: TerminologyConceptScheme
narrower: si327020105

RDF description of 自動車の国産・輸入の別
primary topic: 自動車の国産・輸入の別