RDF description of 自動火災感知器の有無
primary topic: 自動火災感知器の有無

自動火災感知器の有無
type: TerminologyConcept
in scheme: TerminologyConceptScheme
top concept of: TerminologyConceptScheme
broader: Ta00569
created: 2017-12-01
description: 住宅の自動火災感知設備の有無。自動火災感知設備とは、火災の発生を熱、煙又は炎によって自動的に感知し、火災信号又は火災情報信号を消火設備等に発信する設備や、警報等を発する設備をいう。市販されている簡易な設備も自動火災感知設備に含む。共同住宅などで、各住宅の中だけではなく建物の共用部分のみに設置されている設備は含まない。