自脱型コンバイン所有台数
type: TerminologyConcept
description: 所有している自脱型コンバインの台数。コンバインとは、自走式で刈取りから脱穀、選別を同時に行うもので、刈取機に自動脱穀機を取り付けたものをいう。刈幅は２ｍ（６条刈り）未満のもの。機械の購入者でなく、実際に機械を管理している者をその機械を所有しているとみなして所有に含む。また、数戸で共有している機械で、現在、当該調査客体が保管・管理している機械も所有に含む。
created: 2017-12-01
broader: Ta00410
top concept of: TerminologyConceptScheme
in scheme: TerminologyConceptScheme

RDF description of 自脱型コンバイン所有台数
primary topic: 自脱型コンバイン所有台数