自社鉱産品・製造品の品目
type: TerminologyConcept
description: 自社鉱産品及び自社製造品の品目（品物の種類別の項目）。自社鉱産品とは、自社で産出し、販売した鉱産品である。自社製造品とは、自社の事業所が所有する又は有償支給された原材料（製品）によって製造（加工）し、卸売した生産品（原材料を他に支給して製造させた委託生産品を含む。）である
created: 2017-12-01
broader: Ta00583
top concept of: TerminologyConceptScheme
in scheme: TerminologyConceptScheme

RDF description of 自社鉱産品・製造品の品目
primary topic: 自社鉱産品・製造品の品目