自家使用額
type: TerminologyConcept
description: 生産した製品のうち、自工場又は企業内の他の工場で自家用として実際に使用した金額。
created: 2017-12-01
broader: Ta00030
in scheme: TerminologyConceptScheme
top concept of: TerminologyConceptScheme

RDF description of 自家使用額
primary topic: 自家使用額