自営農業以外の仕事状況
type: TerminologyConcept
description: 満15歳以上の世帯員の30日以上よそに雇われて働いた人の自営農業以外の仕事の状況。
created: 2017-12-01
broader: Ta00527
top concept of: TerminologyConceptScheme
in scheme: TerminologyConceptScheme

RDF description of 自営農業以外の仕事状況
primary topic: 自営農業以外の仕事状況