治療の状況
type: TerminologyConcept
description: 最も気になる症状に対して、なんらかの治療をしているか否か。している場合、どのような治療か。
created: 2017-12-01
broader: Ta00627
top concept of: TerminologyConceptScheme
in scheme: TerminologyConceptScheme

RDF description of 治療の状況
primary topic: 治療の状況