RDF description of 次期昇給間差額
primary topic: 次期昇給間差額

次期昇給間差額
type: TerminologyConcept
description: 各地方公共団体の条例に基づき支給する給料月額の号給と、その１号給上位の号給の給料月額との差の金額。
created: 2017-12-01
broader: Ta00088
in scheme: TerminologyConceptScheme
top concept of: TerminologyConceptScheme