時間外労働時間
type: TerminologyConcept
description: 船員法に規定されている労働協約、就業規則等において定められた時間内労働時間を超えて労働し、時間外手当の対象となった労働時間。
created: 2017-12-01
broader: Ta00355
in scheme: TerminologyConceptScheme
top concept of: TerminologyConceptScheme

RDF description of 時間外労働時間
primary topic: 時間外労働時間