持代数
type: TerminologyConcept
description: 歩合給制において、各職種ごと、又は個人ごとに定められている賃金の配分基準（持代）。
created: 2017-12-01
broader: Ta00088
top concept of: TerminologyConceptScheme
in scheme: TerminologyConceptScheme

RDF description of 持代数
primary topic: 持代数