事業収入額（売上高）_1
type: TerminologyConcept
description: 商品・製品などの販売代金やサービスの提供料金など通常の営業活動で得た収入の額。自社鉱産品売上高、自社製造品売上高、加工賃収入額、卸売・小売、飲食・宿泊売上高、サービス事業収入額、その他の事業収入額の合計。消費税、酒税等の間接税を含む。本社・支社（営業所）間及び支社（営業所）相互間の企業取引によるサービス提供を行った場合は、提供価格又は振替仕切額（提供価格・振替仕切額がない場合はサービス提供原価）を含む。売上控除項目（値引き、戻り、割戻し等）は含まない。営業として行っていない財産運用や財産売却による収入などは含まない。クリーニング、写真などの取次業の収入は、一般消費者から受け取る料金ではなく、取次先の業者から受け取る手数料のみ。商品・製品を家事のために消費したり、他人に贈与した場合には、金額に換算した額。割賦販売の場合は、すでに入金した額。掛売りの場合や予約金を受け取っている場合は、商品などを引き渡したときに計上した額である。建設業においては完成工事高を指し、長期の未完成請負工事等については、合理的に見積もった収入の額。
created: 2017-12-01
broader: Ta00069
in scheme: TerminologyConceptScheme
top concept of: TerminologyConceptScheme

RDF description of 事業収入額（売上高）_1
primary topic: 事業収入額（売上高）_1