RDF description of 事業活動日数
primary topic: 事業活動日数

事業活動日数
type: TerminologyConcept
in scheme: TerminologyConceptScheme
top concept of: TerminologyConceptScheme
broader: Ta00359
created: 2017-12-01
description: 定休日、臨時休業日などを除く、営業（操業）日数（売上や仕入がない日であっても、開店（操業）していた場合は含める。）。