RDF description of 事業の内容_2
primary topic: 事業の内容_2

事業の内容_2
type: TerminologyConcept
description: 事業所で行っている事業の内容。２種類以上の事業を行っている場合は、過去１年間の総収入額又は総販売額の最も多い事業の内容である。
created: 2017-12-01
broader: Ta00537
in scheme: TerminologyConceptScheme
narrower: si410010012
narrower: si456010004
narrower: si408010035
narrower: si408010059
narrower: si409020022
narrower: si410020012
narrower: si457010024
narrower: si408010020
narrower: si409010021
narrower: si409020042
narrower: si408020022
narrower: si408020042
top concept of: TerminologyConceptScheme