非常勤の歯科医師の常勤換算数
type: TerminologyConcept
description: 施設が直接雇い入れた者、派遣労働者、出向者、一般の従事者と同様の勤務状況にある家族従事者のうち、常勤以外の歯科医師について、その施設で定めた１週間の勤務時間により常勤に換算した歯科医師の数。
created: 2017-12-01
broader: Ta00119
top concept of: TerminologyConceptScheme
in scheme: TerminologyConceptScheme

RDF description of 非常勤の歯科医師の常勤換算数
primary topic: 非常勤の歯科医師の常勤換算数