資本剰余金の額
type: TerminologyConcept
description: 株主から拠出された金銭・現物のうち、資本金に組み入れなかった額。資本準備金とその他の資本剰余金。建設助成金、工事負担金、私財提供益、改正商法により新たに計上した減資差益等の額。
created: 2017-12-01
broader: Ta00041
top concept of: TerminologyConceptScheme
in scheme: TerminologyConceptScheme

RDF description of 資本剰余金の額
primary topic: 資本剰余金の額