資本準備金の額
type: TerminologyConcept
description: 株式払込剰余金、合併差益、「商法等の一部を改正する等の法律」（平成13年法律第79号）の施行前に既に計上していた減資差益等の額。
created: 2017-12-01
broader: Ta00041
top concept of: TerminologyConceptScheme
in scheme: TerminologyConceptScheme

RDF description of 資本準備金の額
primary topic: 資本準備金の額