視聴覚資料数
type: TerminologyConcept
description: 映画フィルム、スライドフィルム、レコード、録音テープ、コンパクトディスク、ビデオテープ、ビデオディスク及びその他の視聴覚資料数。
created: 2017-12-01
broader: Ta00449
top concept of: TerminologyConceptScheme
in scheme: TerminologyConceptScheme

RDF description of 視聴覚資料数
primary topic: 視聴覚資料数