死因の種類
type: TerminologyConcept
description: 死因の種類、病死及び自然死、不慮の外因死（交通事故、転倒・転落、溺水、煙、火災及び火焔による傷害、窒息、中毒、その他）、その他及び不詳の外因死（自殺、他殺、その他及び不詳の外因）、不詳の別。
created: 2017-12-01
broader: Ta00627
top concept of: TerminologyConceptScheme
in scheme: TerminologyConceptScheme

RDF description of 死因の種類
primary topic: 死因の種類