支払方法_2
type: TerminologyConcept
description: 支払方法がクレジットカード、コンビニ振込、郵便振替・銀行振込、代金引換、その他のいずれであるかの別。
created: 2017-12-01
broader: Ta00555
top concept of: TerminologyConceptScheme
in scheme: TerminologyConceptScheme

RDF description of 支払方法_2
primary topic: 支払方法_2