RDF description of 支払手形・買掛金の額
primary topic: 支払手形・買掛金の額

支払手形・買掛金の額
type: TerminologyConcept
description: 支払手形・買掛金の額。支払手形とは、商品や原材料の購入などのように、通常の営業取引に基づいて生じる仕入先などに支払うべき手形上の債務。約束手形、為替手形など。資金の借入のためや、設備の建設、固定資産等の購入のために振出したものは除く。買掛金とは、商品や製品の仕入代金の未払金、買入れに付帯して生じる運賃・荷造費の未払金など仕入先との通常の取引に基づいて発生した営業上の未払金。
created: 2017-12-01
broader: Ta00049
in scheme: TerminologyConceptScheme
top concept of: TerminologyConceptScheme