支所・支社・支店数_2
type: TerminologyConcept
narrower: si409020044
narrower: si409020045
narrower: si456010006
narrower: si456010007
broader: Ta00381
description: 他の場所にある本所・本社・本店の統括を受けている事業所の数。工場、営業所などのほか、従業者のいる倉庫や管理人のいる寮なども該当する。上位の事業所の統括を受ける一方で、下位の事業所を統括している中間的な事業所も含む。
narrower: si408020044
in scheme: TerminologyConceptScheme
narrower: si408020045
narrower: si408010037
created: 2017-12-01
top concept of: TerminologyConceptScheme
narrower: si408010038

RDF description of 支所・支社・支店数_2
primary topic: 支所・支社・支店数_2