市民農園利用者数
type: TerminologyConcept
description: 市民農園の利用者数。市民農園とは、農地を第三者を経由せず、非農家への貸付又は農園利用方式により利用させて利用料金を得ている事業をいう。農園利用方式とは、相当数の者を対象に、定期的な条件でレクリエーションなど営利以外の目的で継続して行われている農作業の用に供するものであり、賃借権その他の使用及び収益を目的とする権利の設定又は移転を伴わないもので当該農作業の用に供するものに限られるものをいう。
created: 2017-12-01
broader: Ta00150
top concept of: TerminologyConceptScheme
in scheme: TerminologyConceptScheme

RDF description of 市民農園利用者数
primary topic: 市民農園利用者数