子牛の母畜の識別
type: TerminologyConcept
description: 繁殖牛及び肉用牛について、黒毛和種、褐毛和種、日本短角種、無角和種及び外国種のうち該当する母畜が識別できる区分。
created: 2017-12-01
broader: Ta00596
top concept of: TerminologyConceptScheme
in scheme: TerminologyConceptScheme

RDF description of 子牛の母畜の識別
primary topic: 子牛の母畜の識別