子牛の換算係数
type: TerminologyConcept
description: 繁殖めす牛１頭を１か月飼養するのに要する費用を1.0とした場合の子牛１頭を１か月飼養するのに要する費用により計算する。
created: 2017-12-01
broader: Ta00489
in scheme: TerminologyConceptScheme
top concept of: TerminologyConceptScheme

RDF description of 子牛の換算係数
primary topic: 子牛の換算係数