司書教諭数
type: TerminologyConcept
description: 学校図書館法に基づき学校に配置される「司書教諭」の数。司書教諭は、学校図書館の専門的職務を掌る教諭である。
created: 2017-12-01
broader: Ta00122
top concept of: TerminologyConceptScheme
in scheme: TerminologyConceptScheme

RDF description of 司書教諭数
primary topic: 司書教諭数