RDF description of 仕送り所得額
primary topic: 仕送り所得額

仕送り所得額
type: TerminologyConcept
in scheme: TerminologyConceptScheme
top concept of: TerminologyConceptScheme
broader: Ta00013
created: 2017-12-01
description: 世帯員に定期的又は継続的に送られてくる仕送りの額。品物によるものを含む（時価で見積もった額）。