仕事の内容_2
type: TerminologyConcept
description: 個人が実際にしている仕事の内容。２種類以上の仕事をしている場合は、主にしている仕事である。
created: 2017-12-01
broader: Ta00529
in scheme: TerminologyConceptScheme
narrower: si246020009
narrower: si329010010
narrower: si329020010
narrower: si247020007
narrower: si247010007
narrower: si246010009
top concept of: TerminologyConceptScheme

RDF description of 仕事の内容_2
primary topic: 仕事の内容_2