RDF description of 仕向場所
primary topic: 仕向場所

仕向場所
type: TerminologyConcept
description: 「搬出」における貨物の目的場所（１．工場 ２．営業用倉庫 ３．自家用倉庫 ４．卸売店舗 ５．小売店舗 ６．建設作業場 ７．卸売市場 ８．サイロ ９．モータープール １０．野積場 １１．その他）。
created: 2017-12-01
broader: Ta00541
in scheme: TerminologyConceptScheme
top concept of: TerminologyConceptScheme