RDF description of 産休代替等教員数
primary topic: 産休代替等教員数

産休代替等教員数
type: TerminologyConcept
in scheme: TerminologyConceptScheme
top concept of: TerminologyConceptScheme
broader: Ta00122
created: 2017-12-01
description: 「女子教職員の出産に際しての補助教職員の確保に関する法律」によって任用された本務教員（産休代替教員）、及び公立学校においては「地方公務員の育児休業等に関する法律」、国立・私立の学校においては「育児休業、介護休業等育児又は家族介護を行う労働者の福祉に関する法律」によって任用された本務教員（育児休業代替教員）の数。