RDF description of 参加している農業生産組織
primary topic: 参加している農業生産組織

参加している農業生産組織
type: TerminologyConcept
in scheme: TerminologyConceptScheme
top concept of: TerminologyConceptScheme
broader: Ta00578
created: 2017-12-01
description: 農業生産組織に参加しているかどうかの別。農業生産組織とは、複数（２戸以上）の農家が農業生産過程における一部若しくは全部についての共同化・統一化に関する協定の下に結合している生産集団又は農業経営や農作業を組織的に受託する集団（機械・施設の共同利用組織、委託を受けて農作業を行う組織、協業経営体）をいう。