作業委託面積
type: TerminologyConcept
description: 経営耕地（経営委託した土地を除く。）のうち、作業を委託した土地の面積。委託とは、全作業委託及び作業単位の委託のことである。
created: 2017-12-01
broader: Ta00197
in scheme: TerminologyConceptScheme
top concept of: TerminologyConceptScheme

RDF description of 作業委託面積
primary topic: 作業委託面積