在宅患者訪問看護・指導実施件数
type: TerminologyConcept
description: 居宅において療養を行っている通院困難な患者に対して、保健師、助産師、看護師又は准看護師を訪問させて行う看護又は療養上必要な指導の実施件数。
created: 2017-12-01
broader: Ta00401
in scheme: TerminologyConceptScheme
top concept of: TerminologyConceptScheme

RDF description of 在宅患者訪問看護・指導実施件数
primary topic: 在宅患者訪問看護・指導実施件数