在職月数
type: TerminologyConcept
description: 在職月数とは、所属する地方公共団体に在職した月数である。地方公共団体の合併などにより名称が変更となった場合には、前後の年月数を通算して在職月数とする。
created: 2017-12-01
broader: Ta00350
top concept of: TerminologyConceptScheme
in scheme: TerminologyConceptScheme

RDF description of 在職月数
primary topic: 在職月数