RDF description of 在職期間
primary topic: 在職期間

在職期間
type: TerminologyConcept
description: 勤め先（企業）に勤め始めてからの年数。途中で勤務地や職種が変わった場合でも、その勤め先に勤め始めてからの年数及び月数とする。また、季節的に一時休業する仕事であっても毎年繰り返しその仕事についている場合には、その休業期間中も継続して就業しているものとする。
created: 2017-12-01
broader: Ta00350
in scheme: TerminologyConceptScheme
top concept of: TerminologyConceptScheme