在庫面積量
type: TerminologyConcept
description: 在庫量を面積の単位（a、ha、m2、km2、sq.in.、平方デシメートル、畳、坪、畝歩など）で表したもの。在庫量とは、工場及び工場が契約の主体となって借り受けている倉庫又は保管場所に保管している製品、原料及び燃料の数量。販売済みのもので実引渡しとなっているものを含める。出荷指示を受けたもの又は帳簿上売渡し済みのものであっても、現に在庫となっているものについては含める。受託生産した製品を受託者が保管している場合は、受託者の在庫として含める。一社一工場の場合、本社と工場が経理上区別していない倉庫は工場の所属とする。
created: 2017-12-01
broader: Ta00230
top concept of: TerminologyConceptScheme
in scheme: TerminologyConceptScheme

RDF description of 在庫面積量
primary topic: 在庫面積量