RDF description of 在学・在園の状況
primary topic: 在学・在園の状況

在学・在園の状況
type: TerminologyConcept
in scheme: TerminologyConceptScheme
top concept of: TerminologyConceptScheme
broader: Ta00513
created: 2017-12-01
description: 保育所（園）又は幼稚園に在園しているか、小学校に在学しているか、どちらでもないかの別及び保育所（園）の場合は延長保育を利用しているかどうかの別、幼稚園の場合は預かり保育を利用しているかどうかの別、小学校の場合は学童保育を利用しているかどうかの別。なお、延長保育、預かり保育、学童保育を利用しているとは、基本の保育料以外の費用を負担して保育の制度・サービスを利用している場合をいう。